BDBM50414069 CHEMBL564888::JWH-098
SMILES CCCCCn1c(C)c(C(=O)c2ccc(OC)c3ccccc23)c2ccccc12
InChI Key InChIKey=CNTCHEBQQFICNR-UHFFFAOYSA-N
Data  2 KI
  Tab Delimited (TSV)   2D SDfile   Computed 3D by Vconf -m prep SDfile
Find this compound or compounds like it in BindingDB:
Activity Spreadsheet -- Enzyme Inhibition Constant Data from BindingDB
Found 2 hits for monomerid = 50414069
TargetCannabinoid receptor 2(Homo sapiens (Human))
Universidade Federal Do Rio De Janeiro
Curated by ChEMBL
LigandPNGBDBM50414069(CHEMBL564888 | JWH-098)
Affinity DataKi:  1.90nM. Assay description: Displacement of [3H]CP-55940 from human cloned CB2 receptor by filtration assay
In DepthDetails ArticlePubMed
TargetCannabinoid receptor 1(Rattus norvegicus (rat))
Universidade Federal Do Rio De Janeiro
Curated by ChEMBL
LigandPNGBDBM50414069(CHEMBL564888 | JWH-098)
Affinity DataKi:  4.51nM. Assay description: Displacement of [3H]CP-55940 from CB1 receptor in rat brain by filtration assay
In DepthDetails ArticlePubMed