BDBM50415162 CHEMBL572294
SMILES C(N1CCC2(CC1)OCc1ccccc1O2)c1ccccc1
InChI Key InChIKey=YYUPFHGOZHWFOC-UHFFFAOYSA-N
Data  1 KI
  Tab Delimited (TSV)   2D SDfile   Computed 3D by Vconf -m prep SDfile
Find this compound or compounds like it in BindingDB:
Activity Spreadsheet -- Enzyme Inhibition Constant Data from BindingDB
Found 1 hit for monomerid = 50415162
TargetSigma non-opioid intracellular receptor 1(Homo sapiens (Human))
Universit£
Curated by ChEMBL
LigandPNGBDBM50415162(CHEMBL572294)
Affinity DataKi:  0.0977nM. Assay description: Displacement of [3H](+)-pentazocine from sigma1 receptor in human Jurkat cell membrane
In DepthDetails ArticlePubMed