BDBM50416650 CHEMBL1222911
SMILES CC(C)NC(=O)Cn1c(cn2cc(cc2c1=O)N1CCC2(CCCN2C)C1)-c1cccc(Cl)c1
InChI Key InChIKey=HKIIZPBXUBBABL-UHFFFAOYSA-N
Data  1 IC50
  Tab Delimited (TSV)   2D SDfile   Computed 3D by Vconf -m prep SDfile
Find this compound or compounds like it in BindingDB:
Activity Spreadsheet -- Enzyme Inhibition Constant Data from BindingDB
Found 1 hit for monomerid = 50416650
TargetVasopressin V1b receptor(Homo sapiens (Human))
Glaxosmithkline
Curated by ChEMBL
LigandPNGBDBM50416650(CHEMBL1222911)
Affinity DataIC50:  501nM. Assay description: Antagonist activity at human vasopressin 1b receptor expressed in CHO cells assessed as inhibition of vasopressin-induced intracellular calcium mobil...
In DepthDetails ArticlePubMed