BDBM50417299 CHEMBL1276352
SMILES CCN1CCC[C@H]1CNC(=O)c1c(Cl)c(Cl)ccc1OC
InChI Key InChIKey=UBUBRLUXOGROJH-JTQLQIEISA-N
Data  1 IC50
  Tab Delimited (TSV)   2D SDfile   Computed 3D by Vconf -m prep SDfile
Find this compound or compounds like it in BindingDB:
Activity Spreadsheet -- Enzyme Inhibition Constant Data from BindingDB
Found 1 hit for monomerid = 50417299
TargetD(2) dopamine receptor(Homo sapiens (Human))
University Of Mazandaran
Curated by ChEMBL
LigandPNGBDBM50417299(CHEMBL1276352)
Affinity DataIC50:  19.9nM. Assay description: Antagonist activity at dopamine D2 receptor
In DepthDetails ArticlePubMed