BDBM504176 N-(2,2-Dimethyl-6-(4-(oxetan-3- yl)piperazin-1-yl)-2,3- dihydrobenzofuran-5- yl)pyrazolo[1,5-a]pyrimidine-3- carboxamide::US11034698, Example 13
SMILES CC1(C)Cc2cc(NC(=O)c3cnn4cccnc34)c(cc2O1)N1CCN(CC1)C1COC1
InChI Key InChIKey=UYYVIPYSVZARDT-UHFFFAOYSA-N
Data  1 KI
  Tab Delimited (TSV)   2D SDfile   Computed 3D by Vconf -m prep SDfile
Find this compound or compounds like it in BindingDB:
Activity Spreadsheet -- Enzyme Inhibition Constant Data from BindingDB
Found 1 hit for monomerid = 504176
TargetNuclear receptor ROR-gamma(Homo sapiens (Human))
Genentech
US Patent
LigandPNGBDBM504176(N-(2,2-Dimethyl-6-(4-(oxetan-3- yl)piperazin-1-yl)...)
Affinity DataKi:  8.10nM. Assay description: The IRAK4 reaction conditions were optimized using an IRAK1-derived peptide (sequence H-KKARFSRFAGSSPSQSSMVAR) to provide a linear reaction rate over...
Ligand InfoPC cidPC sid
In DepthDetails US Patent