BDBM50418092 CHEMBL1743350
SMILES CC\C(=C(/c1ccccc1)c1ccc(OCCN)cc1)c1ccccc1
InChI Key InChIKey=MCJKBWHDNUSJLW-VHXPQNKSSA-N
Data  2 KI
  Tab Delimited (TSV)   2D SDfile   Computed 3D by Vconf -m prep SDfile
Find this compound or compounds like it in BindingDB:
Activity Spreadsheet -- Enzyme Inhibition Constant Data from BindingDB
Found 2 hits for monomerid = 50418092
TargetCytochrome P450 3A4(Homo sapiens (Human))
F. Hoffmann-La Roche
Curated by ChEMBL
LigandPNGBDBM50418092(CHEMBL1743350)
Affinity DataKi:  2.60E+3nM. Assay description: Mechanism based inhibition of human cytochrome P450 3A4 measured by testosterone 6-beta hydroxylation
In DepthDetails ArticlePubMed
TargetCytochrome P450 3A4(Homo sapiens (Human))
F. Hoffmann-La Roche
Curated by ChEMBL
LigandPNGBDBM50418092(CHEMBL1743350)
Affinity DataKi:  1.20E+4nM. Assay description: Mechanism based inhibition of human cytochrome P450 3A4 measured by midazolam 1'-hydroxylation
In DepthDetails ArticlePubMed