BDBM50419424 CHEMBL1915730
SMILES FCCn1cc(c(n1)-c1ccc(OCc2cccc(Br)n2)cc1)-c1ccncc1
InChI Key InChIKey=JPMVMAONVLPNFR-UHFFFAOYSA-N
Data  1 IC50
  Tab Delimited (TSV)   2D SDfile   Computed 3D by Vconf -m prep SDfile
Find this compound or compounds like it in BindingDB:
Activity Spreadsheet -- Enzyme Inhibition Constant Data from BindingDB
Found 1 hit for monomerid = 50419424
TargetcAMP and cAMP-inhibited cGMP 3',5'-cyclic phosphodiesterase 10A(Rattus norvegicus (rat))
Janssen-Cilag
Curated by ChEMBL
LigandPNGBDBM50419424(CHEMBL1915730)
Affinity DataIC50:  10nM. Assay description: Inhibition of rat recombinant PDE10A expressed in baculovirus infected insect Sf9 cells using [3H]cAMP as substrate after 60 mins by scintillation co...
In DepthDetails ArticlePubMed