BDBM50419428 CHEMBL1915736
SMILES COc1cccnc1COc1ccc(cc1)-c1nn(CCF)cc1-c1ccncc1
InChI Key InChIKey=SIVBTGBSMDUKON-UHFFFAOYSA-N
Data  1 IC50
  Tab Delimited (TSV)   2D SDfile   Computed 3D by Vconf -m prep SDfile
Find this compound or compounds like it in BindingDB:
Activity Spreadsheet -- Enzyme Inhibition Constant Data from BindingDB
Found 1 hit for monomerid = 50419428
TargetcAMP and cAMP-inhibited cGMP 3',5'-cyclic phosphodiesterase 10A(Rattus norvegicus (rat))
Janssen-Cilag
Curated by ChEMBL
LigandPNGBDBM50419428(CHEMBL1915736)
Affinity DataIC50:  3.98nM. Assay description: Inhibition of rat recombinant PDE10A expressed in baculovirus infected insect Sf9 cells using [3H]cAMP as substrate after 60 mins by scintillation co...
In DepthDetails ArticlePubMed