BDBM50419710 CHEMBL1946768
SMILES Oc1ccc(CCNCCc2cccc(CNCCc3c(Cl)cccc3Cl)c2)c2sc(=O)[nH]c12
InChI Key InChIKey=CUTIFGVDJCARNG-UHFFFAOYSA-N
Data  1 IC50
  Tab Delimited (TSV)   2D SDfile   Computed 3D by Vconf -m prep SDfile
Find this compound or compounds like it in BindingDB:
Activity Spreadsheet -- Enzyme Inhibition Constant Data from BindingDB
Found 1 hit for monomerid = 50419710
TargetBeta-2 adrenergic receptor(Homo sapiens (Human))
Astrazeneca
Curated by ChEMBL
LigandPNGBDBM50419710(CHEMBL1946768)
Affinity DataIC50:  0.631nM. Assay description: Displacement of radiolabeled iodocyanopindolol from recombinant beta2 adrenoceptor
In DepthDetails ArticlePubMed