BDBM50419761 CHEMBL1949919
SMILES CS(=O)(=O)c1cccc(c1)-c1cc2c(nc(nc2s1)-c1cnc(N)nc1)N1CCOCC1
InChI Key InChIKey=DKDKIXVBAAAELK-UHFFFAOYSA-N
Data  2 KI
  Tab Delimited (TSV)   2D SDfile   Computed 3D by Vconf -m prep SDfile
Find this compound or compounds like it in BindingDB:
Activity Spreadsheet -- Enzyme Inhibition Constant Data from BindingDB
Found 2 hits for monomerid = 50419761
LigandPNGBDBM50419761(CHEMBL1949919)
Affinity DataKi:  1nM. Assay description: Apparent binding affinity to PI3Kalpha using PIP3 as substrate after 30 mins by fluorescence polarization assay
In DepthDetails ArticlePubMed
LigandPNGBDBM50419761(CHEMBL1949919)
Affinity DataKi:  43nM. Assay description: Apparent binding affinity to PI3Kbeta using PIP3 as substrate after 30 mins by fluorescence polarization assay
In DepthDetails ArticlePubMed