BDBM50420187 CHEMBL2074643::CHENODIOL
SMILES C[C@H](CCC([O-])=O)[C@H]1CC[C@H]2[C@@H]3[C@H](O)C[C@@H]4C[C@H](O)CC[C@]4(C)[C@H]3CC[C@]12C
InChI Key InChIKey=RUDATBOHQWOJDD-BSWAIDMHSA-M
Data  1 KI
  Tab Delimited (TSV)   2D SDfile   Computed 3D by Vconf -m prep SDfile
Find this compound or compounds like it in BindingDB:
Activity Spreadsheet -- Enzyme Inhibition Constant Data from BindingDB
Found 1 hit for monomerid = 50420187
TargetIleal sodium/bile acid cotransporter(Homo sapiens (Human))
Wake Forest University
Curated by ChEMBL
LigandPNGBDBM50420187(CHEMBL2074643 | CHENODIOL)
Affinity DataKi:  3.30E+3nM. Assay description: TP_TRANSPORTER: inhibition of Taurocholate uptake in ASBT-expressing COS cells
In DepthDetails ArticlePubMed