BDBM50420228 CHEMBL2074898
SMILES CC[C@H](C)[C@@H]1N(C)C(=O)[C@H]([C@@H](C)CC)N(C)C(=O)[C@H](CC(=O)OC(C)(C)C)N(C)C(=O)[C@H](NC(=O)[C@@H](C(C)C)N(C)C(=O)[C@H]2CCCCN2C(=O)[C@@H](C)OC(=O)[C@H](Cc2ccc(OC)cc2)NC(=O)[C@H](C(C)C)N(C)C(=O)CNC1=O)C(C)C
InChI Key InChIKey=UGWMRFXIOXUDPM-HKONDZHQSA-N
Data  2 EC50
  Tab Delimited (TSV)   2D SDfile   Computed 3D by Vconf -m prep SDfile
Find this compound or compounds like it in BindingDB:
Activity Spreadsheet -- Enzyme Inhibition Constant Data from BindingDB
Found 2 hits for monomerid = 50420228
TargetATP-dependent translocase ABCB1(Homo sapiens (Human))
Strasbourg 1 University
Curated by ChEMBL
LigandPNGBDBM50420228(CHEMBL2074898)
Affinity DataEC50:  60nM. Assay description: TP_TRANSPORTER: increase in Calcein-AM intracellular accumulation (Calcein-AM: 0.25 uM) in MDR-P388 cells
In DepthDetails ArticlePubMed
TargetATP-dependent translocase ABCB1(Homo sapiens (Human))
Strasbourg 1 University
Curated by ChEMBL
LigandPNGBDBM50420228(CHEMBL2074898)
Affinity DataEC50:  220nM. Assay description: TP_TRANSPORTER: increase in Calcein-AM intracellular accumulation (Calcein-AM: 0.25 uM) in MDR-CEM cells
In DepthDetails ArticlePubMed