BDBM50420422 CHEMBL2089340
SMILES CCNc1nc(nc2n(cnc12)[C@@H]1[C@H]2C[C@H]2[C@@H](O)[C@H]1O)C#Cc1ccccc1Cl
InChI Key InChIKey=LJBWDPHNRHYITG-KFNRRLBXSA-N
Data  1 KI
  Tab Delimited (TSV)   2D SDfile   Computed 3D by Vconf -m prep SDfile
Find this compound or compounds like it in BindingDB:
Activity Spreadsheet -- Enzyme Inhibition Constant Data from BindingDB
Found 1 hit for monomerid = 50420422
TargetAdenosine receptor A3(Homo sapiens (Human))
TBA
Curated by ChEMBL
LigandPNGBDBM50420422(CHEMBL2089340)
Affinity DataKi:  5.80nM. Assay description: Displacement of [3H]I-AB-MECA from human recombinant adenosine A3 receptor expressed in CHO cells after 60 mins by liquid scintillation counting
In DepthDetails ArticlePubMed