BDBM50421050 CHEMBL2087841
SMILES CC(C)Cn1c2nn(Cc3ccnc4ccc(Cl)cc34)c(-c3cccn3C)c2c(=O)n(C)c1=O
InChI Key InChIKey=XYGGSEPNMJOMER-UHFFFAOYSA-N
Data  1 IC50
  Tab Delimited (TSV)   2D SDfile   Computed 3D by Vconf -m prep SDfile
Find this compound or compounds like it in BindingDB:
Activity Spreadsheet -- Enzyme Inhibition Constant Data from BindingDB
Found 1 hit for monomerid = 50421050
TargetGlutamate racemase(Helicobacter pylori J99)
Astrazeneca
Curated by ChEMBL
LigandPNGBDBM50421050(CHEMBL2087841)
Affinity DataIC50:  260nM. Assay description: Inhibition of Helicobacter pylori J99 glutamate racemase
In DepthDetails ArticlePubMed