BDBM50421059 CHEMBL2087849
SMILES Cn1cncc1-c1n(Cc2ccnc3ccc(Cl)cc23)nc2n(CC3CC3)c(=O)n(CC3CC3)c(=O)c12
InChI Key InChIKey=LTQJNQDKHOMARK-UHFFFAOYSA-N
Data  1 IC50
  Tab Delimited (TSV)   2D SDfile   Computed 3D by Vconf -m prep SDfile
Find this compound or compounds like it in BindingDB:
Activity Spreadsheet -- Enzyme Inhibition Constant Data from BindingDB
Found 1 hit for monomerid = 50421059
TargetGlutamate racemase(Helicobacter pylori J99)
Astrazeneca
Curated by ChEMBL
LigandPNGBDBM50421059(CHEMBL2087849)
Affinity DataIC50:  69nM. Assay description: Inhibition of Helicobacter pylori J99 glutamate racemase
In DepthDetails ArticlePubMed