BDBM50421211 CHEMBL2087281
SMILES OC(=O)c1ccc(cc1)N(Cc1ccccc1)Cc1ccc(Oc2ccccc2)cc1
InChI Key InChIKey=AKSPIFIPBJLDQC-UHFFFAOYSA-N
Data  1 IC50
  Tab Delimited (TSV)   2D SDfile   Computed 3D by Vconf -m prep SDfile
Find this compound or compounds like it in BindingDB:
Activity Spreadsheet -- Enzyme Inhibition Constant Data from BindingDB
Found 1 hit for monomerid = 50421211
TargetGlucocorticoid receptor(Homo sapiens (Human))
Zydus Research Centre
Curated by ChEMBL
LigandPNGBDBM50421211(CHEMBL2087281)
Affinity DataIC50: >9.00E+3nM. Assay description: Displacement of [3H]dexamethasone from human glucocorticoid receptor expressed in baculovirus infected Sf9 cells after overnight incubation by scinti...
In DepthDetails ArticlePubMed