BDBM50421507 CHEMBL64028::ORG-24629
SMILES CN(CCC(Oc1ccc(cc1)C(F)(F)F)c1ccccc1)CCC([O-])=O
InChI Key InChIKey=VHOCQZQQMCXWHY-UHFFFAOYSA-M
Data  1 IC50
  Tab Delimited (TSV)   2D SDfile   Computed 3D by Vconf -m prep SDfile
Find this compound or compounds like it in BindingDB:
Activity Spreadsheet -- Enzyme Inhibition Constant Data from BindingDB
Found 1 hit for monomerid = 50421507
TargetSodium- and chloride-dependent glycine transporter 1(Homo sapiens (Human))
Organon Research And Development Group
Curated by ChEMBL
LigandPNGBDBM50421507(CHEMBL64028 | ORG-24629)
Affinity DataIC50:  3.16E+4nM. Assay description: Inhibition of [3H]glycine uptake using CHO cells transfected with GlyT-1b transporter
In DepthDetails ArticlePubMed