BDBM50421920 CHEMBL555401
SMILES CCCN1CC[C@@H]2[C@@H](CCc3ccccc23)C1
InChI Key InChIKey=CVPQFQKDTUSMII-GOEBONIOSA-N
Data  1 IC50
  Tab Delimited (TSV)   2D SDfile   Computed 3D by Vconf -m prep SDfile
Find this compound or compounds like it in BindingDB:
Activity Spreadsheet -- Enzyme Inhibition Constant Data from BindingDB
Found 1 hit for monomerid = 50421920
TargetSigma non-opioid intracellular receptor 1(Homo sapiens (Human))
Merck Sharp And Dohme Research Laboratories
Curated by ChEMBL
LigandPNGBDBM50421920(CHEMBL555401)
Affinity DataIC50:  2.60nM. Assay description: In vitro for the binding affinity against sigma receptor by using [3H]DTG as radioligand in guinea pig cerebellum
In DepthDetails ArticlePubMed