BDBM50421930 CHEMBL1788382
SMILES [#6]\[#6](-[#6])=[#6]\[#6]-[#7]-1-[#6]-[#6]C2([#6]-[#6]-c3ccccc23)[#6]-[#6]-1
InChI Key InChIKey=ULBZOYYHHRLQMV-UHFFFAOYSA-N
Data  2 IC50
  Tab Delimited (TSV)   2D SDfile   Computed 3D by Vconf -m prep SDfile
Find this compound or compounds like it in BindingDB:
Activity Spreadsheet -- Enzyme Inhibition Constant Data from BindingDB
Found 2 hits for monomerid = 50421930
TargetD(2) dopamine receptor(Rattus norvegicus (rat))
Merck Sharp And Dohme Research Laboratories
Curated by ChEMBL
LigandPNGBDBM50421930(CHEMBL1788382)
Affinity DataIC50:  1.70E+4nM. Assay description: In vitro for the binding affinity against dopamine receptor D2 by using [3H](-)-sulpiride as radioligand in rat striatum.
In DepthDetails ArticlePubMed
TargetSigma non-opioid intracellular receptor 1(Homo sapiens (Human))
Merck Sharp And Dohme Research Laboratories
Curated by ChEMBL
LigandPNGBDBM50421930(CHEMBL1788382)
Affinity DataIC50:  1.20nM. Assay description: In vitro binding affinity against sigma receptor by using [3H]-DTG ([3H]-6) as radioligand in guinea pig cerebellum.
In DepthDetails ArticlePubMed