BDBM50421936 CHEMBL1744013
SMILES Oc1ccc2CCCC3(CCN(Cc4ccccc4)CC3)c2c1
InChI Key InChIKey=LXGHMOHXKHUUDV-UHFFFAOYSA-N
Data  1 IC50
  Tab Delimited (TSV)   2D SDfile   Computed 3D by Vconf -m prep SDfile
Find this compound or compounds like it in BindingDB:
Activity Spreadsheet -- Enzyme Inhibition Constant Data from BindingDB
Found 1 hit for monomerid = 50421936
TargetSigma non-opioid intracellular receptor 1(Homo sapiens (Human))
Merck Sharp And Dohme Research Laboratories
Curated by ChEMBL
LigandPNGBDBM50421936(CHEMBL1744013)
Affinity DataIC50:  69nM. Assay description: In vitro binding affinity against sigma receptor by using [3H]-DTG ([3H]-6) as radioligand in guinea pig cerebellum.
In DepthDetails ArticlePubMed