BDBM50421981 CHEMBL607877
SMILES CC(C)N=Nc1nc(N)c2ncn(C3O[C@H](CO)[C@@H](O)[C@H]3O)c2n1
InChI Key InChIKey=DCKGSRCOMAOUHX-PUXKXDTASA-N
Data  2 EC50
  Tab Delimited (TSV)   2D SDfile   Computed 3D by Vconf -m prep SDfile
Find this compound or compounds like it in BindingDB:
Activity Spreadsheet -- Enzyme Inhibition Constant Data from BindingDB
Found 2 hits for monomerid = 50421981
TargetAdenosine receptor A2a/A2b(Homo sapiens (Human))
University Of South Florida
Curated by ChEMBL
LigandPNGBDBM50421981(CHEMBL607877)
Affinity DataEC50:  50nM. Assay description: In vitro effect on coronary vasodilation in guinea pig heart.
In DepthDetails ArticlePubMed
TargetAdenosine receptor A1(GUINEA PIG)
University Of South Florida
Curated by ChEMBL
LigandPNGBDBM50421981(CHEMBL607877)
Affinity DataEC50:  1.20E+4nM. Assay description: In vitro prolonging of the stimulus-QRS interval in guinea pig heart.
In DepthDetails ArticlePubMed