BDBM50422865 CHEMBL213225
SMILES Clc1ccc(cc1)C1=NN(CCCC1)S(=O)(=O)c1cccc(Cl)c1
InChI Key InChIKey=HKFNEVBJSSKLCF-UHFFFAOYSA-N
Data  1 IC50
  Tab Delimited (TSV)   2D SDfile   Computed 3D by Vconf -m prep SDfile
Find this compound or compounds like it in BindingDB:
Activity Spreadsheet -- Enzyme Inhibition Constant Data from BindingDB
Found 1 hit for monomerid = 50422865
TargetProgesterone receptor(Homo sapiens (Human))
Glaxosmithkline
Curated by ChEMBL
LigandPNGBDBM50422865(CHEMBL213225)
Affinity DataIC50:  1.26E+3nM. Assay description: Antagonist activity against PR beta-mediated transactivation of MMTV luciferase reporter gene in BacMam transduced progesterone-stimulated CV1 cells
In DepthDetails ArticlePubMed