BDBM50422867 CHEMBL379847
SMILES Clc1ccc(c(Cl)c1)S(=O)(=O)N1CCCCC(=N1)c1ccc(Cl)c(Cl)c1
InChI Key InChIKey=UWRSFIXITXHHDP-UHFFFAOYSA-N
Data  1 IC50
  Tab Delimited (TSV)   2D SDfile   Computed 3D by Vconf -m prep SDfile
Find this compound or compounds like it in BindingDB:
Activity Spreadsheet -- Enzyme Inhibition Constant Data from BindingDB
Found 1 hit for monomerid = 50422867
TargetProgesterone receptor(Homo sapiens (Human))
Glaxosmithkline
Curated by ChEMBL
LigandPNGBDBM50422867(CHEMBL379847)
Affinity DataIC50:  200nM. Assay description: Antagonist activity against PR beta-mediated transactivation of MMTV luciferase reporter gene in BacMam transduced progesterone-stimulated CV1 cells
In DepthDetails ArticlePubMed