BDBM50422883 CHEMBL213724
SMILES Cc1c(C)c(=O)oc2cc(CCc3ccccc3)ccc12
InChI Key InChIKey=JGJJYTJJKXNVSH-UHFFFAOYSA-N
Data  2 IC50
  Tab Delimited (TSV)   2D SDfile   Computed 3D by Vconf -m prep SDfile
Find this compound or compounds like it in BindingDB:
Activity Spreadsheet -- Enzyme Inhibition Constant Data from BindingDB
Found 2 hits for monomerid = 50422883
TargetAmine oxidase [flavin-containing] A(Rattus norvegicus (rat))
Universit£
Curated by ChEMBL
LigandPNGBDBM50422883(CHEMBL213724)
Affinity DataIC50:  7.08E+3nM. Assay description: Inhibition of Sprague-Dawley rat brain mitochondria MAOA by continuous spectrophotometric assay
In DepthDetails ArticlePubMed
TargetAmine oxidase [flavin-containing] B(Rattus norvegicus (rat))
Universit£
Curated by ChEMBL
LigandPNGBDBM50422883(CHEMBL213724)
Affinity DataIC50:  457nM. Assay description: Inhibition of Sprague-Dawley rat brain mitochondria MAOB by continuous spectrophotometric assay
In DepthDetails ArticlePubMed