BDBM504229 N-[2-[(2R)-2-Fluoro-3-hydroxy- 3-methyl-butyl]-6-isopropoxy-1- oxo-isoindolin-5- yl]pyrazolo[1,5-a]pyrimidine-3- carboxamide::US11034698, Example 78
SMILES CC(C)Oc1cc2C(=O)N(C[C@@H](F)C(C)(C)O)Cc2cc1NC(=O)c1cnn2cccnc12
InChI Key InChIKey=NNWSGLOSADNTJJ-LJQANCHMSA-N
Data  1 KI
  Tab Delimited (TSV)   2D SDfile   Computed 3D by Vconf -m prep SDfile
Find this compound or compounds like it in BindingDB:
Activity Spreadsheet -- Enzyme Inhibition Constant Data from BindingDB
Found 1 hit for monomerid = 504229
TargetNuclear receptor ROR-gamma(Homo sapiens (Human))
Genentech
US Patent
LigandPNGBDBM504229(N-[2-[(2R)-2-Fluoro-3-hydroxy- 3-methyl-butyl]-6-i...)
Affinity DataKi:  0.170nM. Assay description: The IRAK4 reaction conditions were optimized using an IRAK1-derived peptide (sequence H-KKARFSRFAGSSPSQSSMVAR) to provide a linear reaction rate over...
Ligand InfoPC cidPC sid
In DepthDetails US Patent