BDBM50423873 CHEMBL2024151
SMILES CCN1\C(=C\C=C\C=C\C2=[N+](CCCCCC(=O)NCCOCCOCCNC(=O)CCC(=O)Nc3nc4ccccc4n4c3nn(-c3ccc(OC)cc3)c4=O)c3cc(ccc3C2(C)C)S([O-])(=O)=O)C(C)(C)c2cc(ccc12)S(O)(=O)=O
InChI Key InChIKey=HCXPCPSUEGMFJQ-UHFFFAOYSA-N
Data  1 Kd
  Tab Delimited (TSV)   2D SDfile   Computed 3D by Vconf -m prep SDfile
Find this compound or compounds like it in BindingDB:
Activity Spreadsheet -- Enzyme Inhibition Constant Data from BindingDB
Found 1 hit for monomerid = 50423873
TargetAdenosine receptor A3(Homo sapiens (Human))
University Of Nottingham
Curated by ChEMBL
LigandPNGBDBM50423873(CHEMBL2024151)
Affinity DataKd:  148nM. Assay description: Antagonist activity at human adenosine A3 receptor expressed in forskolin-stimulated CHO cells assessed as inhibition of NECA-induced CRE-SPAP gene t...
In DepthDetails ArticlePubMed