BDBM50423874 CHEMBL2024152
SMILES COc1ccc(cc1)-n1nc2c(NC(=O)CCC(=O)NCCOCCOCCNC(=O)CCOCCOCCOCCOCCOCCOCCOCCOCCOCCOCCOCCOCCNC(=O)c3ccc(c(c3)C([O-])=O)-c3c4ccc(cc4oc4cc(ccc34)=[N+](C)C)N(C)C)nc3ccccc3n2c1=O
InChI Key InChIKey=ZUOKUFOVUDFJRV-UHFFFAOYSA-N
Data  1 Kd
  Tab Delimited (TSV)   2D SDfile   Computed 3D by Vconf -m prep SDfile
Find this compound or compounds like it in BindingDB:
Activity Spreadsheet -- Enzyme Inhibition Constant Data from BindingDB
Found 1 hit for monomerid = 50423874
TargetAdenosine receptor A3(Homo sapiens (Human))
University Of Nottingham
Curated by ChEMBL
LigandPNGBDBM50423874(CHEMBL2024152)
Affinity DataKd:  5.60nM. Assay description: Antagonist activity at human adenosine A3 receptor expressed in forskolin-stimulated CHO cells assessed as inhibition of NECA-induced CRE-SPAP gene t...
In DepthDetails ArticlePubMed