BDBM50424064 CHEMBL2314741
SMILES COc1ccc2C[C@@H]3N(CCc4cc5OCOc5cc34)Cc2c1O[C@@H]1O[C@H](CO)[C@@H](O)[C@H](O)[C@H]1O
InChI Key InChIKey=OCHYIOQLUNYHOD-IMBIOGTGSA-N
Data  3 IC50
  Tab Delimited (TSV)   2D SDfile   Computed 3D by Vconf -m prep SDfile
Find this compound or compounds like it in BindingDB:
Activity Spreadsheet -- Enzyme Inhibition Constant Data from BindingDB
Found 3 hits for monomerid = 50424064
TargetTissue factor(Homo sapiens (Human))
China Pharmaceutical University
Curated by ChEMBL
LigandPNGBDBM50424064(CHEMBL2314741)
Affinity DataIC50:  39nM. Assay description: Inhibition of tissue factor procoagulant activity in LPS-stimulated human THP1 cells preincubated for 1 hr before LPS addition measured after 5 hrs
In DepthDetails ArticlePubMed
TargetD(2) dopamine receptor(Homo sapiens (Human))
Huzhou University
Curated by ChEMBL
LigandPNGBDBM50424064(CHEMBL2314741)
Affinity DataIC50: >1.00E+4nM. Assay description: Antagonist activity at D2 receptor (unknown origin) expressed in CHOK1 cells assessed as inhibition of dopamine-induced calcium flux preincubated for...
In DepthDetails ArticlePubMed
TargetD(1A) dopamine receptor(Homo sapiens (Human))
Huzhou University
Curated by ChEMBL
LigandPNGBDBM50424064(CHEMBL2314741)
Affinity DataIC50: >1.00E+4nM. Assay description: Antagonist activity at D1 receptor (unknown origin) expressed in CHOK1 cells assessed as inhibition of SKF38393-induced cAMP accumulation measured af...
In DepthDetails ArticlePubMed