BDBM50424080 CHEMBL2314749
SMILES CNS(=O)(=O)CC[C@H]1O[C@H](C[C@@H]1O)n1cc(C)c(=O)[nH]c1=O
InChI Key InChIKey=KMGCQWGYMHMKEX-IVZWLZJFSA-N
Data  1 KI
  Tab Delimited (TSV)   2D SDfile   Computed 3D by Vconf -m prep SDfile
Find this compound or compounds like it in BindingDB:
Activity Spreadsheet -- Enzyme Inhibition Constant Data from BindingDB
Found 1 hit for monomerid = 50424080
TargetThymidylate kinase(Mycobacterium tuberculosis)
Ghent University
Curated by ChEMBL
LigandPNGBDBM50424080(CHEMBL2314749)
Affinity DataKi:  2.40E+5nM. Assay description: Inhibition of Mycobacterium tuberculosis thymidine monophosphate kinase by enzyme-coupling based spectrophotometric assay
In DepthDetails ArticlePubMed