BDBM504246 N-[6-(Dimethylamino)-2- isopropyl-1-oxo-isoindolin-5- yl]pyrazolo[1,5-a]pyrimidine-3- carboxamide::US11034698, Example 95
SMILES CC(C)N1Cc2cc(NC(=O)c3cnn4cccnc34)c(cc2C1=O)N(C)C
InChI Key InChIKey=KVJVIDOOVMAIQN-UHFFFAOYSA-N
Data  1 KI
  Tab Delimited (TSV)   2D SDfile   Computed 3D by Vconf -m prep SDfile
Find this compound or compounds like it in BindingDB:
Activity Spreadsheet -- Enzyme Inhibition Constant Data from BindingDB
Found 1 hit for monomerid = 504246
TargetNuclear receptor ROR-gamma(Homo sapiens (Human))
Genentech
US Patent
LigandPNGBDBM504246(N-[6-(Dimethylamino)-2- isopropyl-1-oxo-isoindolin...)
Affinity DataKi:  1.90nM. Assay description: The IRAK4 reaction conditions were optimized using an IRAK1-derived peptide (sequence H-KKARFSRFAGSSPSQSSMVAR) to provide a linear reaction rate over...
Ligand InfoPC cidPC sid
In DepthDetails US Patent