BDBM50424629 CHEMBL2313193
SMILES Cc1ccc(c(C)c1)S(=O)(=O)N1CCC(CC1)C(=O)Nc1ccc(O)cc1
InChI Key InChIKey=RHBRFKAVBDKUBY-UHFFFAOYSA-N
Data  1 IC50
  Tab Delimited (TSV)   2D SDfile   Computed 3D by Vconf -m prep SDfile
Find this compound or compounds like it in BindingDB:
Activity Spreadsheet -- Enzyme Inhibition Constant Data from BindingDB
Found 1 hit for monomerid = 50424629
TargetBifunctional epoxide hydrolase 2(Homo sapiens (Human))
Columbia University
Curated by ChEMBL
LigandPNGBDBM50424629(CHEMBL2313193)
Affinity DataIC50:  0.400nM. Assay description: Inhibition of human sEH assessed as 6-methoxy-2-naphthaldehyde generation preincubated for 10 before addition of cyano(2-methyl-oxynaphthalen-6-yl)me...
In DepthDetails ArticlePubMed