BDBM50425663 CHEMBL2315558
SMILES CN(c1ncccc1CNc1ncnc2[nH]c(C)cc12)S(C)(=O)=O
InChI Key InChIKey=LXXIFYVVYROXSL-UHFFFAOYSA-N
Data  1 Kd
  Tab Delimited (TSV)   2D SDfile   Computed 3D by Vconf -m prep SDfile
Find this compound or compounds like it in BindingDB:
Activity Spreadsheet -- Enzyme Inhibition Constant Data from BindingDB
Found 1 hit for monomerid = 50425663
TargetFocal adhesion kinase 1(Homo sapiens (Human))
Merck Serono
Curated by ChEMBL
LigandPNGBDBM50425663(CHEMBL2315558)
Affinity DataKd:  5.70E+4nM. Assay description: Binding affinity to FAK (unknown origin) by surface plasmon resonance analysis
In DepthDetails ArticlePubMed