BDBM50425664 CHEMBL2315559
SMILES CN(c1ncccc1CNc1ncnc2[nH]ccc12)S(C)(=O)=O
InChI Key InChIKey=PCYSSBDVKUPKCJ-UHFFFAOYSA-N
Data  1 IC50  1 Kd
  Tab Delimited (TSV)   2D SDfile   Computed 3D by Vconf -m prep SDfile
Find this compound or compounds like it in BindingDB:
Activity Spreadsheet -- Enzyme Inhibition Constant Data from BindingDB
Found 2 hits for monomerid = 50425664
TargetFocal adhesion kinase 1(Homo sapiens (Human))
Merck Serono
Curated by ChEMBL
LigandPNGBDBM50425664(CHEMBL2315559)
Affinity DataKd:  3.10E+3nM. Assay description: Binding affinity to FAK (unknown origin) by surface plasmon resonance analysis
In DepthDetails ArticlePubMed
TargetFocal adhesion kinase 1(Homo sapiens (Human))
Merck Serono
Curated by ChEMBL
LigandPNGBDBM50425664(CHEMBL2315559)
Affinity DataIC50:  8.90E+3nM. Assay description: Inhibition of FAK (unknown origin) using biotinylated His-TEV-hsFAK(31-686)(K454R) substrate after 2 hrs by scintillation counting analysis
In DepthDetails ArticlePubMed