BDBM50425680 CHEMBL2315582
SMILES CCCCc1ccc(cc1)-c1cc2c(NCc3cccnc3N(C)S(C)(=O)=O)c(cnc2[nH]1)C#N
InChI Key InChIKey=CPCDDWOHUAQHHR-UHFFFAOYSA-N
Data  1 IC50  1 Kd
  Tab Delimited (TSV)   2D SDfile   Computed 3D by Vconf -m prep SDfile
Find this compound or compounds like it in BindingDB:
Activity Spreadsheet -- Enzyme Inhibition Constant Data from BindingDB
Found 2 hits for monomerid = 50425680
TargetFocal adhesion kinase 1(Homo sapiens (Human))
Merck Serono
Curated by ChEMBL
LigandPNGBDBM50425680(CHEMBL2315582)
Affinity DataIC50: >1.00E+4nM. Assay description: Inhibition of FAK (unknown origin) using biotinylated His-TEV-hsFAK(31-686)(K454R) substrate after 2 hrs by scintillation counting analysis
In DepthDetails ArticlePubMed
TargetFocal adhesion kinase 1(Homo sapiens (Human))
Merck Serono
Curated by ChEMBL
LigandPNGBDBM50425680(CHEMBL2315582)
Affinity DataKd:  430nM. Assay description: Binding affinity to FAK (unknown origin) by surface plasmon resonance analysis
In DepthDetails ArticlePubMed