BDBM50427321 CHEMBL2325704
SMILES CS(=O)(=O)C1(CC1)c1cc(nc(n1)-c1cccc2[nH]ccc12)N1CCOCC1
InChI Key InChIKey=UUEAFRKZMCDHFV-UHFFFAOYSA-N
Data  8 IC50
  Tab Delimited (TSV)   2D SDfile   Computed 3D by Vconf -m prep SDfile
Find this compound or compounds like it in BindingDB:
Activity Spreadsheet -- Enzyme Inhibition Constant Data from BindingDB
Found 8 hits for monomerid = 50427321
TargetSerine/threonine-protein kinase mTOR(Homo sapiens (Human))
Astrazeneca
Curated by ChEMBL
LigandPNGBDBM50427321(CHEMBL2325704)
Affinity DataIC50:  3.20E+3nM. Assay description: Inhibition of mTOR-mediated AKT phosphorylation at serine 473 in human MDA-MB-468 cells
In DepthDetails ArticlePubMed
TargetSerine/threonine-protein kinase ATR(Homo sapiens (Human))
Astrazeneca
Curated by ChEMBL
LigandPNGBDBM50427321(CHEMBL2325704)
Affinity DataIC50:  360nM. Assay description: Inhibition of ATR-mediated CHK1 phosphorylation at serine 345 in human HT29 cells after 1 hr in presence of 4-nitroquinoline 1-oxide
In DepthDetails ArticlePubMed
TargetSerine/threonine-protein kinase ATR(Homo sapiens (Human))
Astrazeneca
Curated by ChEMBL
LigandPNGBDBM50427321(CHEMBL2325704)
Affinity DataIC50:  8nM. Assay description: Inhibition of ATR-mediated CHK1 phosphorylation at serine 345 in human HT29 cells after 1 hr in presence of 4-nitroquinoline 1-oxide
In DepthDetails ArticlePubMed
TargetSerine/threonine-protein kinase ATR(Homo sapiens (Human))
Astrazeneca
Curated by ChEMBL
LigandPNGBDBM50427321(CHEMBL2325704)
Affinity DataIC50:  290nM. Assay description: Inhibition of ATR in human HT29 cells after 60 mins by Hoechst 33258 staining-based assay
In DepthDetails ArticlePubMed
LigandPNGBDBM50427321(CHEMBL2325704)
Affinity DataIC50:  940nM. Assay description: Inhibition of PI3Kalpha-mediated AKT phosphorylation at threonine 308 in human BT474 cells
In DepthDetails ArticlePubMed
TargetSerine/threonine-protein kinase mTOR(Homo sapiens (Human))
Astrazeneca
Curated by ChEMBL
LigandPNGBDBM50427321(CHEMBL2325704)
Affinity DataIC50:  180nM. Assay description: Inhibition of mTOR-mediated AKT phosphorylation at serine 473 in human MDA-MB-468 cells
In DepthDetails ArticlePubMed
TargetSerine/threonine-protein kinase ATR(Homo sapiens (Human))
Astrazeneca
Curated by ChEMBL
LigandPNGBDBM50427321(CHEMBL2325704)
Affinity DataIC50:  8nM. Assay description: Inhibition of ATR in human HeLa cell nuclear extract using GST-fused p53N66 as substrate preincubated for 10 mins followed by ATP addition and measur...
In DepthDetails ArticlePubMed
TargetPotassium voltage-gated channel subfamily H member 2(Homo sapiens (Human))
Astrazeneca
Curated by ChEMBL
LigandPNGBDBM50427321(CHEMBL2325704)
Affinity DataIC50: >1.00E+5nM. Assay description: Inhibition of human ERG by whole-cell electrophysiology assay
In DepthDetails ArticlePubMed