BDBM50427565 CHEMBL2322896
SMILES Clc1ccc(cc1)N(C[C@@H]1CNC[C@H]1Cc1ccccc1)c1ccccc1
InChI Key InChIKey=FCWGSUKXROLTNW-RTWAWAEBSA-N
Data  5 IC50
PDB links: 1 PDB ID matches this monomer.
  Tab Delimited (TSV)   2D SDfile   Computed 3D by Vconf -m prep SDfile
Find this compound or compounds like it in BindingDB:
Activity Spreadsheet -- Enzyme Inhibition Constant Data from BindingDB
Found 5 hits for monomerid = 50427565
TargetRenin(Homo sapiens (Human))
Novartis Pharma
Curated by ChEMBL
LigandPNGBDBM50427565(CHEMBL2322896)
Affinity DataIC50:  7.60E+3nM. Assay description: Inhibition of human recombinant renin expressed in CHO cells using RE(EDANS)IHPFHLVIHTK(Dabcyl)R as substrate incubated for 1 hr prior to substrate a...
TargetGastricsin(Homo sapiens (Human))
Novartis Pharma
Curated by ChEMBL
LigandPNGBDBM50427565(CHEMBL2322896)
Affinity DataIC50:  2.90E+4nM. Assay description: Inhibition of human recombinant pepsin C expressed in Escherichia coli using Dabcyl-E-R-Nle-F-L-S-F-P-EDANS as substrate incubated for 1 hr prior to ...
In DepthDetails ArticlePubMed
TargetRenin(Homo sapiens (Human))
Novartis Pharma
Curated by ChEMBL
LigandPNGBDBM50427565(CHEMBL2322896)
Affinity DataIC50:  1.40E+4nM. Assay description: Inhibition of human recombinant renin expressed in CHO cells using RE(EDANS)IHPFHLVIHTK(Dabcyl)R as substrate incubated for 1 hr prior to substrate a...
TargetCathepsin D(Homo sapiens (Human))
Novartis Pharma
Curated by ChEMBL
LigandPNGBDBM50427565(CHEMBL2322896)
Affinity DataIC50:  1.10E+4nM. Assay description: Inhibition of human recombinant cathepsin-D expressed in baculovirus-infected insect sf9 cells using Ac- E-D(EDANS)-KPILFFRLG-K(Dabcyl)-E-Amid as sub...
In DepthDetails ArticlePubMed
TargetCathepsin E(Homo sapiens (Human))
Novartis Pharma
Curated by ChEMBL
LigandPNGBDBM50427565(CHEMBL2322896)
Affinity DataIC50:  1.10E+4nM. Assay description: Inhibition of human recombinant cathepsin-E expressed in Escherichia coli using Ac- E-D(EDANS)-KPILFFRLG-K(Dabcyl)-E-Amid as substrate incubated for ...
In DepthDetails ArticlePubMed