BDBM50427865 CHEMBL2326358
SMILES Cc1cc(N)nc(CCc2cc(CCCN)cc(CCc3cc(C)cc(N)n3)c2)c1
InChI Key InChIKey=TUMIYXWSFLIVFR-UHFFFAOYSA-N
Data  6 KI
PDB links: 2 PDB IDs match this monomer.
  Tab Delimited (TSV)   2D SDfile   Computed 3D by Vconf -m prep SDfile
Find this compound or compounds like it in BindingDB:
Activity Spreadsheet -- Enzyme Inhibition Constant Data from BindingDB
Found 6 hits for monomerid = 50427865
TargetNitric oxide synthase, brain(Rattus norvegicus (rat))
University Of California
Curated by ChEMBL
LigandPNGBDBM50427865(CHEMBL2326358)
Affinity DataKi:  540nM. Assay description: Inhibition of rat nNOS
TargetNitric oxide synthase, brain(Rattus norvegicus (rat))
University Of California
Curated by ChEMBL
LigandPNGBDBM50427865(CHEMBL2326358)
Affinity DataKi:  540nM. Assay description: Inhibition of rat recombinant nNOS expressed in Escherichia coli using L-arginine as substrate
TargetNitric oxide synthase, endothelial(Bos taurus (bovine))
Northwestern University
Curated by ChEMBL
LigandPNGBDBM50427865(CHEMBL2326358)
Affinity DataKi:  1.21E+4nM. Assay description: Inhibition of bovine recombinant eNOS expressed in Escherichia coli using L-arginine as substrate
In DepthDetails ArticlePubMed
TargetNitric oxide synthase, endothelial(Bos taurus (bovine))
Northwestern University
Curated by ChEMBL
LigandPNGBDBM50427865(CHEMBL2326358)
Affinity DataKi:  1.21E+4nM. Assay description: Inhibition of bovine eNOS
In DepthDetails ArticlePubMed
TargetNitric oxide synthase, inducible(Mus musculus (mouse))
Northwestern University
Curated by ChEMBL
LigandPNGBDBM50427865(CHEMBL2326358)
Affinity DataKi:  3.25E+4nM. Assay description: Inhibition of mouse recombinant iNOS expressed in Escherichia coli using L-arginine as substrate
In DepthDetails ArticlePubMed
TargetNitric oxide synthase, inducible(Mus musculus (mouse))
Northwestern University
Curated by ChEMBL
LigandPNGBDBM50427865(CHEMBL2326358)
Affinity DataKi:  3.25E+4nM. Assay description: Inhibition of mouse iNOS
In DepthDetails ArticlePubMed