BDBM50429023 CHEMBL2334071
SMILES Cc1c(oc2ccc(cc12)-c1ccccc1)C(=O)Nc1ccc(nc1)N1CCC(COc2cccc(CC(O)=O)c2)CC1
InChI Key InChIKey=QTUZWWMPCWBLRT-UHFFFAOYSA-N
Data  1 IC50
  Tab Delimited (TSV)   2D SDfile   Computed 3D by Vconf -m prep SDfile
Find this compound or compounds like it in BindingDB:
Activity Spreadsheet -- Enzyme Inhibition Constant Data from BindingDB
Found 1 hit for monomerid = 50429023
TargetDiacylglycerol O-acyltransferase 1(Homo sapiens (Human))
Merck Research Laboratories
Curated by ChEMBL
LigandPNGBDBM50429023(CHEMBL2334071)
Affinity DataIC50:  120nM. Assay description: Inhibition of human DGAT1 expressed in Sf9 cells using 1,2-dioleoyl-sn-glycerol and [14C]-palmitoyl-Co A substrates incubated for 2 hrs by scintillat...
In DepthDetails ArticlePubMed