BDBM50429024 CHEMBL2334070
SMILES Cc1c(oc2ccc(cc12)-c1ccccc1)C(=O)Nc1ccc(nc1)N1CC[C@H](COc2cccc(c2)C(O)=O)C1
InChI Key InChIKey=SHQJSZLUAVTKKF-QFIPXVFZSA-N
Data  1 IC50
  Tab Delimited (TSV)   2D SDfile   Computed 3D by Vconf -m prep SDfile
Find this compound or compounds like it in BindingDB:
Activity Spreadsheet -- Enzyme Inhibition Constant Data from BindingDB
Found 1 hit for monomerid = 50429024
TargetDiacylglycerol O-acyltransferase 1(Homo sapiens (Human))
Merck Research Laboratories
Curated by ChEMBL
LigandPNGBDBM50429024(CHEMBL2334070)
Affinity DataIC50:  119nM. Assay description: Inhibition of human DGAT1 expressed in Sf9 cells using 1,2-dioleoyl-sn-glycerol and [14C]-palmitoyl-Co A substrates incubated for 2 hrs by scintillat...
In DepthDetails ArticlePubMed