BDBM50430067 CHEMBL2336420
SMILES CC(C)c1cc(CC(NC(=O)N2CCC(CC2)N2Cc3ccccc3NC2=O)C(=O)N2CCC(CC2)N2CCCCC2)cc2cn[nH]c12
InChI Key InChIKey=NFKNHAHXAMZIFN-UHFFFAOYSA-N
Data  1 KI  1 IC50
  Tab Delimited (TSV)   2D SDfile   Computed 3D by Vconf -m prep SDfile
Find this compound or compounds like it in BindingDB:
Activity Spreadsheet -- Enzyme Inhibition Constant Data from BindingDB
Found 2 hits for monomerid = 50430067
TargetCalcitonin gene-related peptide type 1 receptor(Homo sapiens (Human))
Bristol-Myers Squibb Research & Development
Curated by ChEMBL
LigandPNGBDBM50430067(CHEMBL2336420)
Affinity DataKi:  0.220nM. Assay description: Binding affinity to CGRP receptor (unknown origin)
In DepthDetails ArticlePubMed
TargetCytochrome P450 3A4(Homo sapiens (Human))
Bristol-Myers Squibb Research & Development
Curated by ChEMBL
LigandPNGBDBM50430067(CHEMBL2336420)
Affinity DataIC50:  370nM. Assay description: Inhibition of CYP3A4 (unknown origin) using 7-benzyloxy-resorufin as substrate
In DepthDetails ArticlePubMed