BDBM50430966 CHEMBL2337849
SMILES C[C@H](NC(=O)[C@H](Cc1ccc(OCc2ccccc2)cc1)NC(=O)OC(C)(C)C)C(=O)N[C@@H](C[C@]1(O)C(=O)Nc2ccccc12)C(=O)NCc1ccccc1
InChI Key InChIKey=LEFDHTPNDGQXKD-KUNNGYQLSA-N
Data  2 KI  6 IC50
  Tab Delimited (TSV)   2D SDfile   Computed 3D by Vconf -m prep SDfile
Find this compound or compounds like it in BindingDB:
Activity Spreadsheet -- Enzyme Inhibition Constant Data from BindingDB
Found 8 hits for monomerid = 50430966
TargetProteasome subunit beta type-5(Homo sapiens (Human))
University Paris 6
Curated by ChEMBL
LigandPNGBDBM50430966(CHEMBL2337849)
Affinity DataKi:  2.43E+3nM. Assay description: Mixed type inhibition of chymotrypsin-like activity of human constitutive 20s proteasome beta-5 subunit using Suc-LLVY-AMC as substrate assessed as i...
In DepthDetails ArticlePubMed
TargetProteasome subunit beta type-5(Homo sapiens (Human))
University Paris 6
Curated by ChEMBL
LigandPNGBDBM50430966(CHEMBL2337849)
Affinity DataKi:  5.03E+3nM. Assay description: Mixed type inhibition of chymotrypsin-like activity of human constitutive 20s proteasome beta-5 subunit using Suc-LLVY-AMC as substrate assessed as i...
In DepthDetails ArticlePubMed
TargetProteasome subunit beta type-5(Saccharomyces cerevisiae)
University Paris 6
Curated by ChEMBL
LigandPNGBDBM50430966(CHEMBL2337849)
Affinity DataIC50:  1.50E+3nM. Assay description: Inhibition of chymotrypsin-like activity of yeast 20S proteasome beta-5 subunit using Suc-LLVY-AMC as substrate measured up to 45 mins by fluorescenc...
In DepthDetails ArticlePubMed
TargetProteasome subunit beta type-2(Homo sapiens (Human))
University Paris 6
Curated by ChEMBL
LigandPNGBDBM50430966(CHEMBL2337849)
Affinity DataIC50:  7.16E+3nM. Assay description: Inhibition of trypsin-like activity of human constitutive 20s proteasome beta-2 subunit using Boc-LRR-AMC as substrate assessed as remaining activity...
In DepthDetails ArticlePubMed
TargetProteasome subunit beta type-5(Homo sapiens (Human))
University Paris 6
Curated by ChEMBL
LigandPNGBDBM50430966(CHEMBL2337849)
Affinity DataIC50:  7.97E+3nM. Assay description: Inhibition of chymotrypsin-like activity of proteasome beta-5 subunit in HEK293 cells using Suc-LLVY-Glo as substrate incubated for 2 hrs prior to su...
In DepthDetails ArticlePubMed
TargetProteasome subunit beta type-5(Homo sapiens (Human))
University Paris 6
Curated by ChEMBL
LigandPNGBDBM50430966(CHEMBL2337849)
Affinity DataIC50:  3.19E+3nM. Assay description: Inhibition of chymotrypsin-like activity of human constitutive 20s proteasome beta-5 subunit using Suc-LLVY-AMC as substrate assessed as remaining ac...
In DepthDetails ArticlePubMed
TargetProteasome subunit beta type-1(Homo sapiens (Human))
University Paris 6
Curated by ChEMBL
LigandPNGBDBM50430966(CHEMBL2337849)
Affinity DataIC50:  1.15E+4nM. Assay description: Inhibition of postacid activity of human constitutive 20s proteasome beta-1 subunit using Z-LLE-betaNA as substrate assessed as remaining activity in...
In DepthDetails ArticlePubMed
TargetProteasome subunit beta type-1(Homo sapiens (Human))
University Paris 6
Curated by ChEMBL
LigandPNGBDBM50430966(CHEMBL2337849)
Affinity DataIC50:  1.60E+4nM. Assay description: Inhibition of postacid activity of 20s proteasome beta-1 subunit in HEK293 cells using Z-nLPnLD-Glo as substrate incubated for 2 hrs prior to substra...
In DepthDetails ArticlePubMed