BDBM50431115 CHEMBL2332044
SMILES CC(C)(C)OC(=O)NCCC1CCN(CC1)c1ncnc2cc(sc12)C(N)=O
InChI Key InChIKey=CQMOSWGPJHVHLC-UHFFFAOYSA-N
Data  3 IC50
  Tab Delimited (TSV)   2D SDfile   Computed 3D by Vconf -m prep SDfile
Find this compound or compounds like it in BindingDB:
Activity Spreadsheet -- Enzyme Inhibition Constant Data from BindingDB
Found 3 hits for monomerid = 50431115
TargetNAD-dependent protein deacetylase sirtuin-3, mitochondrial(Homo sapiens (Human))
Sirtris A Gsk
Curated by ChEMBL
LigandPNGBDBM50431115(CHEMBL2332044)
Affinity DataIC50:  29nM. Assay description: Inhibition of human His-tagged SIRT3 (102 to 399) expressed in Escherichia coli BL21(DE3) assessed as inhibition of deacetylation of Ac-RHKKAcW-NH2 s...
In DepthDetails ArticlePubMed
TargetNAD-dependent protein deacetylase sirtuin-1(Homo sapiens (Human))
Sirtris A Gsk
Curated by ChEMBL
LigandPNGBDBM50431115(CHEMBL2332044)
Affinity DataIC50:  17nM. Assay description: Inhibition of His-tagged SIRT1 (1 to 747) (unknown origin)-mediated deacetylation of Ac-RHKKAcW-NH2 substrate preincubated for 20 mins measured after...
In DepthDetails ArticlePubMed
TargetNAD-dependent protein deacetylase sirtuin-2(Homo sapiens (Human))
Sirtris A Gsk
Curated by ChEMBL
LigandPNGBDBM50431115(CHEMBL2332044)
Affinity DataIC50:  5.40nM. Assay description: Inhibition of His-tagged SIRT2 (1 to 389) (unknown origin)-mediated deacetylation of Ac-RHKKAcW-NH2 substrate incubated for 20 mins prior to substrat...
In DepthDetails ArticlePubMed