BDBM50431261 CHEMBL2333044::US9428465, 11
SMILES CCCCCCNC(=O)n1cc(NC)c(=O)[nH]c1=O
InChI Key InChIKey=AKFJHMZDHFEJLR-UHFFFAOYSA-N
Data  2 IC50
  Tab Delimited (TSV)   2D SDfile   Computed 3D by Vconf -m prep SDfile
Find this compound or compounds like it in BindingDB:
Activity Spreadsheet -- Enzyme Inhibition Constant Data from BindingDB
Found 2 hits for monomerid = 50431261
TargetAcid ceramidase(Rattus norvegicus (Rat))
Fondazione Istituto Italiano Di Tecnologia
Curated by ChEMBL
LigandPNGBDBM50431261(CHEMBL2333044 | US9428465, 11)
Affinity DataIC50:  3.40E+3nM. Assay description: Inhibition of rat recombinant acid ceramidase expressed in human HEK293 cells using N-lauroylceramide as substrate incubated for 30 mins prior to sub...
In DepthDetails ArticlePubMed
TargetAcid ceramidase(Rattus norvegicus (Rat))
Fondazione Istituto Italiano Di Tecnologia
Curated by ChEMBL
LigandPNGBDBM50431261(CHEMBL2333044 | US9428465, 11)
Affinity DataIC50:  3.40E+3nMpH: 4.5Assay Description:r-AC protein samples were pre-incubated with various concentrations of test compounds or vehicle control in 100 mM NaH2PO4/citrate buffer pH 4.5, 0.1...
In DepthDetails US Patent