BDBM50431339 CHEMBL2348843
SMILES CNc1nc(c(s1)-c1ccnc(Nc2ccc(cc2)S(N)(=O)=O)n1)C(F)(F)F
InChI Key InChIKey=FPHITTVVVWKENE-UHFFFAOYSA-N
Data  4 KI
  Tab Delimited (TSV)   2D SDfile   Computed 3D by Vconf -m prep SDfile
Find this compound or compounds like it in BindingDB:
Activity Spreadsheet -- Enzyme Inhibition Constant Data from BindingDB
Found 4 hits for monomerid = 50431339
TargetCyclin-dependent kinase/G2/mitotic-specific cyclin- 1(Homo sapiens (Human))
University Of Nottingham
Curated by ChEMBL
LigandPNGBDBM50431339(CHEMBL2348843)
Affinity DataKi:  0.5nM. Assay description: Inhibition of human recombinant His6 tagged CDK1/Cyclin B expressed in Sf21 insect cells after 40 mins by scintillation counting analysis
In DepthDetails ArticlePubMed
TargetCyclin-A1/Cyclin-A2/Cyclin-dependent kinase 2(Homo sapiens (Human))
University Of Nottingham
Curated by ChEMBL
LigandPNGBDBM50431339(CHEMBL2348843)
Affinity DataKi:  1.5nM. Assay description: Inhibition of human recombinant His6 tagged CDK2/Cyclin A expressed in Sf21 insect cells after 40 mins by scintillation counting analysis
In DepthDetails ArticlePubMed
TargetCyclin-T1/Cyclin-dependent kinase 9(Homo sapiens (Human))
University Of Nottingham
Curated by ChEMBL
LigandPNGBDBM50431339(CHEMBL2348843)
Affinity DataKi:  3nM. Assay description: Inhibition of human recombinant His6 tagged CDK9/CyclinT1 expressed in Sf21 insect cells after 40 mins by scintillation counting analysis
In DepthDetails ArticlePubMed
TargetCyclin-H/Cyclin-dependent kinase 7(Homo sapiens (Human))
University Of Nottingham
Curated by ChEMBL
LigandPNGBDBM50431339(CHEMBL2348843)
Affinity DataKi:  64nM. Assay description: Inhibition of human recombinant His6 tagged CDK7/CyclinH/MAT1 expressed in Sf21 insect cells after 40 mins by scintillation counting analysis
In DepthDetails ArticlePubMed