BDBM50431719 CHEMBL2346724::MTE
SMILES Cc1csc(n1)C#Cc1cccnc1
InChI Key InChIKey=ZTOHOXCKSPKZEM-UHFFFAOYSA-N
Data  1 IC50
  Tab Delimited (TSV)   2D SDfile   Computed 3D by Vconf -m prep SDfile
Find this compound or compounds like it in BindingDB:
Activity Spreadsheet -- Enzyme Inhibition Constant Data from BindingDB
Found 1 hit for monomerid = 50431719
TargetMetabotropic glutamate receptor 5(Homo sapiens (Human))
Sk Biopharmaceuticals
Curated by ChEMBL
LigandPNGBDBM50431719(CHEMBL2346724 | MTE)
Affinity DataIC50:  12nM. Assay description: Negative allosteric modulation of human mGluR5 expressed in HEK293 cells assessed as calcium mobilization by FLIPR assay
In DepthDetails ArticlePubMed