BDBM50432252 CHEMBL2347504
SMILES [#6]-[#16]-[#6]-[#6]-[#6@H](-[#7]-[#6](=O)-[#6@H](-[#6]-[#6](-[#6])-[#6])-[#7]-[#6](=O)-[#6]-[#7]-[#6](=O)-[#6@H](-[#6]-c1ccccc1)-[#7](-[#6])-[#6](=O)-[#6@H](-[#6]-c1ccccc1)-[#7]-[#6](=O)-[#6@H](-[#6]-[#6](-[#8])=O)-[#7]-[#6](=O)-[#6@H](-[#6]-[#6](-[#8])=O)-[#7]-[#6](=O)-[#6@@H]-1-[#6]-[#6]-[#6]-[#7]-1-[#6](=O)-[#6@H](-[#6]-[#6]-[#6]\[#7]=[#6](/[#7])-[#7])-[#7]-[#6](=O)-[#6@@H]-1-[#6]-[#6]-[#6]-[#7]-1-[#6](=O)-[#6@@H](-[#7])-[#6]-[#6]-[#6]-[#6]-[#7])-[#6](-[#7])=O
InChI Key InChIKey=SJEPSLCHAMJTGS-BHEJXMHWSA-N
Data  1 IC50  1 EC50
  Tab Delimited (TSV)   2D SDfile   Computed 3D by Vconf -m prep SDfile
Find this compound or compounds like it in BindingDB:
Activity Spreadsheet -- Enzyme Inhibition Constant Data from BindingDB
Found 2 hits for monomerid = 50432252
TargetNeuromedin-K receptor(Homo sapiens (Human))
Kyoto University
Curated by ChEMBL
LigandPNGBDBM50432252(CHEMBL2347504)
Affinity DataIC50:  31nM. Assay description: Displacement of ([125I]-His3, MePhe7)-NKB from NK3R (unknown origin) transfected in CHO cells by gamma counting analysis
In DepthDetails ArticlePubMed
TargetNeuromedin-K receptor(Homo sapiens (Human))
Kyoto University
Curated by ChEMBL
LigandPNGBDBM50432252(CHEMBL2347504)
Affinity DataEC50:  5nM. Assay description: Agonist activity at NK3R (unknown origin) transfected in CHO cells assessed as calcium influx at 10 mM
In DepthDetails ArticlePubMed