BDBM504324 US11040968, Example 005::WX005
SMILES Cc1cc(F)c(cc1-n1cnc(n1)C1CC1)C(=O)Nc1cccc(n1)-c1nnc2CCCCn12
InChI Key InChIKey=KYRWZZKWIFDRTR-UHFFFAOYSA-N
Data  1 IC50
  Tab Delimited (TSV)   2D SDfile   Computed 3D by Vconf -m prep SDfile
Find this compound or compounds like it in BindingDB:
Activity Spreadsheet -- Enzyme Inhibition Constant Data from BindingDB
Found 1 hit for monomerid = 504324
TargetMitogen-activated protein kinase kinase kinase 5(Homo sapiens (Human))
TBA
US Patent
LigandPNGBDBM504324(US11040968, Example 005 | WX005)
Affinity DataIC50:  35.3nM. Assay description: Primary reaction buffer solution: 20 mM Hepes (pH 7.5), 10 mM MgCl2, 1 mM EGTA, 0.02% Brij35, 0.02 mg/ml BSA, 0.1 mM Na3VO4, 2 mM DTT, 1% DMSOTreatme...
Ligand InfoPC cidPC sid
In DepthDetails US Patent