BDBM50432604 CHEMBL2347186
SMILES NC1=N[C@@](CF)([C@@H](F)CO1)c1cc(NC(=O)c2ccc(cn2)C#N)ccc1F
InChI Key InChIKey=MMPPCMJOPZGPPA-MAUKXSAKSA-N
Data  2 IC50
PDB links: 1 PDB ID matches this monomer.
  Tab Delimited (TSV)   2D SDfile   Computed 3D by Vconf -m prep SDfile
Find this compound or compounds like it in BindingDB:
Activity Spreadsheet -- Enzyme Inhibition Constant Data from BindingDB
Found 2 hits for monomerid = 50432604
TargetBeta-secretase 1(Homo sapiens (Human))
F. Hoffmann-La Roche
Curated by ChEMBL
LigandPNGBDBM50432604(CHEMBL2347186)
Affinity DataIC50:  25nM. Assay description: Inhibition of human BACE1 in HEK293 cells transfected with wild type APP assessed as reduction of amyloid beta40 level after 18 to 20 hrs by AlphaLIS...
TargetBeta-secretase 1(Homo sapiens (Human))
F. Hoffmann-La Roche
Curated by ChEMBL
LigandPNGBDBM50432604(CHEMBL2347186)
Affinity DataIC50:  77nM. Assay description: Inhibition of human BACE1 using MR121-labeled substrate incubated for 4 mins prior to substrate addition measured after 2 mins by spectrophotometric ...