BDBM50432927 CHEMBL2377219
SMILES O=S(=O)(Nc1ccccn1)c1ccc(cc1)-c1ccc(cc1)C#N
InChI Key InChIKey=DEJLPRSKSNGMCR-UHFFFAOYSA-N
Data  1 EC50
  Tab Delimited (TSV)   2D SDfile   Computed 3D by Vconf -m prep SDfile
Find this compound or compounds like it in BindingDB:
Activity Spreadsheet -- Enzyme Inhibition Constant Data from BindingDB
Found 1 hit for monomerid = 50432927
Target11-beta-hydroxysteroid dehydrogenase 1(Homo sapiens (Human))
Pfizer
Curated by ChEMBL
LigandPNGBDBM50432927(CHEMBL2377219)
Affinity DataEC50:  604nM. Assay description: Inhibition of 11beta-HSD1 in human HEK293 cells
In DepthDetails ArticlePubMed