BDBM50433527 CHEMBL2381379
SMILES CC(C)(O)Cn1cc(cn1)-c1ccc2-c3nc(sc3CCOc2c1)-c1ncnn1CC(F)(F)F
InChI Key InChIKey=VRJUJTMBOARYOG-UHFFFAOYSA-N
Data  1 KI  3 IC50
PDB links: 1 PDB ID matches this monomer.
  Tab Delimited (TSV)   2D SDfile   Computed 3D by Vconf -m prep SDfile
Find this compound or compounds like it in BindingDB:
Activity Spreadsheet -- Enzyme Inhibition Constant Data from BindingDB
Found 4 hits for monomerid = 50433527
LigandPNGBDBM50433527(CHEMBL2381379)
Affinity DataKi:  0.140nM. Assay description: Inhibition of GST-fused human recombinant PI3Kalpha expressed in baculovirus infected SF9 cells after 1 hr by scintillation proximity assay in presen...
In DepthDetails ArticlePubMed
LigandPNGBDBM50433527(CHEMBL2381379)
Affinity DataIC50:  1.40nM. Assay description: Inhibition of GST-fused human recombinant PI3Kgamma expressed in baculovirus infected SF9 cells after 1 hr by scintillation proximity assay in presen...
LigandPNGBDBM50433527(CHEMBL2381379)
Affinity DataIC50:  15nM. Assay description: Inhibition of GST-fused human recombinant PI3Kbeta expressed in baculovirus infected SF9 cells after 1 hr by scintillation proximity assay in presenc...
In DepthDetails ArticlePubMed
LigandPNGBDBM50433527(CHEMBL2381379)
Affinity DataIC50:  122nM. Assay description: Inhibition of PI3Kalpha in human PC3 cells assessed as inhibition of AKT phosphorylation at Ser473 after 2 hrs by ELISA
In DepthDetails ArticlePubMed